BDBM92028 erk000397
SMILES Cc1cnc(Nc2ccccc2)nc1-c1c[nH]c(c1)C(=O)N[C@@H](CO)c1ccc(F)c(Cl)c1
InChI Key InChIKey=XTDIOKFHATYXDZ-NRFANRHFSA-N
Data  2 KI
  Tab Delimited (TSV)   2D SDfile   Computed 3D by Vconf -m prep SDfile
Find this compound or compounds like it in BindingDB:
Activity Spreadsheet -- Enzyme Inhibition Constant Data from BindingDB
Found 2 hits for monomerid = 92028
TargetMitogen-activated protein kinase 1(Homo sapiens (Human))
D3R/Abbott
LigandPNGBDBM92028(erk000397)
Affinity DataKi:  4nM. Assay description: Photometric_Method2
In DepthDetails PubMed
TargetMitogen-activated protein kinase 1(Homo sapiens (Human))
D3R/Abbott
LigandPNGBDBM92028(erk000397)
Affinity DataKi:  4nM. Assay description: Assay 1 ...
In DepthDetails PubMed