BDBM92089 erk000517
SMILES Cc1cnc(Nc2ccccn2)nc1-c1c[nH]c(c1)C(=O)N[C@H](CO)c1ccccc1
InChI Key InChIKey=RUWONJMWERFTIY-LJQANCHMSA-N
Data  2 KI
  Tab Delimited (TSV)   2D SDfile   Computed 3D by Vconf -m prep SDfile
Find this compound or compounds like it in BindingDB:
Activity Spreadsheet -- Enzyme Inhibition Constant Data from BindingDB
Found 1 hit for monomerid = 92089
TargetMitogen-activated protein kinase 1(Homo sapiens (Human))
D3R/Abbott
LigandPNGBDBM92089(erk000517)
Affinity DataKi:  0.400nM. Assay description: Photometric_Method2
In DepthDetails PubMed