BDBM92143 erk000591
SMILES Cc1cnc(Nc2cccc3OC(F)(F)Oc23)nc1-c1c[nH]c(c1)C(=O)N[C@H](CO)c1ccccc1
InChI Key InChIKey=QIYAIWBZSCVFCT-LJQANCHMSA-N
Data  2 KI
  Tab Delimited (TSV)   2D SDfile   Computed 3D by Vconf -m prep SDfile
Find this compound or compounds like it in BindingDB:
Activity Spreadsheet -- Enzyme Inhibition Constant Data from BindingDB
Found 2 hits for monomerid = 92143
TargetMitogen-activated protein kinase 1(Homo sapiens (Human))
D3R/Abbott
LigandPNGBDBM92143(erk000591)
Affinity DataKi:  7.90nM. Assay description: Photometric_Method2
In DepthDetails PubMed
TargetMitogen-activated protein kinase 1(Homo sapiens (Human))
D3R/Abbott
LigandPNGBDBM92143(erk000591)
Affinity DataKi:  8nM. Assay description: Assay 1 ...
In DepthDetails PubMed