BDBM92238 erk000706
SMILES C[C@@H](CO)Nc1ncc(C)c(n1)-c1cc(C(=O)N[C@H](CO)c2ccccc2)n(C)c1
InChI Key InChIKey=MJAXTEACCRJLGT-MAUKXSAKSA-N
Data  2 KI
  Tab Delimited (TSV)   2D SDfile   Computed 3D by Vconf -m prep SDfile
Find this compound or compounds like it in BindingDB:
Activity Spreadsheet -- Enzyme Inhibition Constant Data from BindingDB
Found 2 hits for monomerid = 92238
TargetMitogen-activated protein kinase 1(Homo sapiens (Human))
D3R/Abbott
LigandPNGBDBM92238(erk000706)
Affinity DataKi:  6nM. Assay description: Photometric_Method2
In DepthDetails PubMed
TargetMitogen-activated protein kinase 1(Homo sapiens (Human))
D3R/Abbott
LigandPNGBDBM92238(erk000706)
Affinity DataKi:  6nM. Assay description: Assay 1 ...
In DepthDetails PubMed