BDBM92239 erk000708
SMILES CC(C)Nc1ncc(Cl)c(n1)-c1c[nH]c(c1)C(=O)N(C)[C@H](CO)c1ccccc1
InChI Key InChIKey=VUBUDMRKXHYWIS-GOSISDBHSA-N
Data  2 KI
  Tab Delimited (TSV)   2D SDfile   Computed 3D by Vconf -m prep SDfile
Find this compound or compounds like it in BindingDB:
Activity Spreadsheet -- Enzyme Inhibition Constant Data from BindingDB
Found 2 hits for monomerid = 92239
TargetMitogen-activated protein kinase 1(Homo sapiens (Human))
D3R/Abbott
LigandPNGBDBM92239(erk000708)
Affinity DataKi:  6nM. Assay description: Photometric_Method2
In DepthDetails PubMed
TargetMitogen-activated protein kinase 1(Homo sapiens (Human))
D3R/Abbott
LigandPNGBDBM92239(erk000708)
Affinity DataKi:  6nM. Assay description: Assay 1 ...
In DepthDetails PubMed