BDBM92252 erk000721
SMILES CC[C@@H](CO)Nc1ncc(C)c(n1)-c1c[nH]c(c1)C(=O)N[C@H](COP([O-])([O-])=O)c1cccc(Cl)c1
InChI Key InChIKey=XBBMMBBDCZWWLJ-PKOBYXMFSA-L
Data  2 KI
  Tab Delimited (TSV)   2D SDfile   Computed 3D by Vconf -m prep SDfile
Find this compound or compounds like it in BindingDB:
Activity Spreadsheet -- Enzyme Inhibition Constant Data from BindingDB
Found 2 hits for monomerid = 92252
TargetMitogen-activated protein kinase 1(Homo sapiens (Human))
D3R/Abbott
LigandPNGBDBM92252(erk000721)
Affinity DataKi:  4nM. Assay description: Photometric_Method2
In DepthDetails PubMed
TargetMitogen-activated protein kinase 1(Homo sapiens (Human))
D3R/Abbott
LigandPNGBDBM92252(erk000721)
Affinity DataKi:  4nM. Assay description: Assay 1 ...
In DepthDetails PubMed