Target
Tyrosine-protein kinase JAK1 [861-1152]
Ligand
BDBM173971
Substrate
Meas. Tech.
JAK1 Kinase Assay
IC50
19±n/a nM
Citation
 Brasca, MGBindi, SCaldarelli, MNesi, MOrrenius, SCPanzeri, A Substituted pyrroles active as kinases inhibitors US Patent  US9688661 Publication Date 6/27/2017 
Target
Name:
Tyrosine-protein kinase JAK1 [861-1152]
Synonyms:
JAK1 JAK1B Tyrosine-protein kinase JAK1 (JAK1)
Type:
Protein
Mol. Mass.:
33439.94
Organism:
Homo sapiens (Human)
Description:
Human JAK1 variant (861-1152 aa)
Residue:
292
  
Inhibitor
Name:
BDBM173971
Synonyms:
US9688661, 3-[2-Ethyl-5-(trifluoromethyl)phenyl]-5-(7H-pyrrolo[2,3-d]pyrimidin-4-yl)-1H-pyrrole-2-carboxamide (compd 125)
Type:
Small organic molecule
Emp. Form.:
C20H15F3N5O
Mol. Mass.:
398.3612
SMILES:
CCc1ccc(cc1-c1cc(nc1C(N)=O)-c1ncnc2[nH]ccc12)C(F)(F)F
: