Target
Tyrosine-protein kinase JAK1 [861-1152]
Ligand
BDBM174014
Substrate
Meas. Tech.
JAK1 Kinase Assay
IC50
8.00±n/a nM
Citation
 Brasca, MGBindi, SCaldarelli, MNesi, MOrrenius, SCPanzeri, A Substituted pyrroles active as kinases inhibitors US Patent  US9688661 Publication Date 6/27/2017 
Target
Name:
Tyrosine-protein kinase JAK1 [861-1152]
Synonyms:
JAK1 JAK1B Tyrosine-protein kinase JAK1 (JAK1)
Type:
Protein
Mol. Mass.:
33439.94
Organism:
Homo sapiens (Human)
Description:
Human JAK1 variant (861-1152 aa)
Residue:
292
  
Inhibitor
Name:
BDBM174014
Synonyms:
US9688661, 1-(5-Chloro-2-methylphenyl)-4-(6,7-dihydro-5H-pyrrolo[2,3-d]pyrimidin-4-yl)-1H-pyrrole-2-carboxamide (compd 234)
Type:
Small organic molecule
Emp. Form.:
C17H16ClN6O
Mol. Mass.:
355.802
SMILES:
Cc1ccc(Cl)cc1-n1cn(cc1C(N)=O)-c1ncnc2CCNc12
: