Target
Tyrosine-protein kinase JAK1 [861-1152]
Ligand
BDBM50069344
Substrate
Meas. Tech.
JAK1 Kinase Assay
IC50
85±n/a nM
Citation
 Brasca, MGBindi, SCaldarelli, MNesi, MOrrenius, SCPanzeri, A Substituted pyrroles active as kinases inhibitors US Patent  US9688661 Publication Date 6/27/2017 
Target
Name:
Tyrosine-protein kinase JAK1 [861-1152]
Synonyms:
JAK1 JAK1B Tyrosine-protein kinase JAK1 (JAK1)
Type:
Protein
Mol. Mass.:
33439.94
Organism:
Homo sapiens (Human)
Description:
Human JAK1 variant (861-1152 aa)
Residue:
292
  
Inhibitor
Name:
BDBM50069344
Synonyms:
CHEMBL3403537 | US9688661, 4-(5-Chloro-2-methylphenyl)-1-(7H-pyrrolo[2,3-d]pyrimidin-4-yl)-1H-pyrrole-3-carboxamide (compd 270)
Type:
Small organic molecule
Emp. Form.:
C18H14ClN5O
Mol. Mass.:
351.79
SMILES:
Cc1ccc(Cl)cc1-c1cn(cc1C(N)=O)-c1ncnc2[nH]ccc12
: