Target
Tyrosine-protein kinase JAK3
Ligand
BDBM316711
Substrate
Meas. Tech.
Caliper Enzyme Assay (4 uM ATP)
IC50
0.100±n/a nM
Citation
 Thorarensen, ABrown, MFCasimiro-Garcia, AChe, YCoe, JWFlanagan, MEGilbert, AMHayward, MMLangille, JDMontgomery, JITelliez, JUnwalla, RJTrujillo, JI Pyrrolo[2,3-d]pyrimidinyl, pyrrolo[2,3-b]pyrazinyl and pyrrolo[2,3-d]pyridinyl acrylamides US Patent  US11111242 Publication Date 9/7/2021 
Target
Name:
Tyrosine-protein kinase JAK3
Synonyms:
JAK-3 JAK3_HUMAN Janus kinase 3 (JAK3) L-JAK | Leukocyte janus kinase
Type:
Protein
Mol. Mass.:
125111.08
Organism:
Homo sapiens (Human)
Description:
P52333
Residue:
1124
  
Inhibitor
Name:
BDBM316711
Synonyms:
5-{2-[(1-acryloylpiperidin-4-yl)amino]-5H-pyrrolo[2,3-b]pyrazin-7-yl}pyridine-3-carbonitrile US9617258, Example 206
Type:
Small organic molecule
Emp. Form.:
C20H19N7O
Mol. Mass.:
373.4112
SMILES:
C=CC(=O)N1CCC(CC1)Nc1cnc2[nH]cc(-c3cncc(c3)C#N)c2n1
: