Target
Glycogen synthase kinase-3 beta
Ligand
BDBM8140
Substrate
Biotinylated Peptide Substrate
Meas. Tech.
Kinase Inhibition SPA Assay
Ki
2±n/a nM
IC50
<10±n/a nM
Citation
 Tavares, FXBoucheron, JADickerson, SHGriffin, RJPreugschat, FThomson, SAWang, TYZhou, HQ N-Phenyl-4-pyrazolo[1,5-b]pyridazin-3-ylpyrimidin-2-amines as potent and selective inhibitors of glycogen synthase kinase 3 with good cellular efficacy. J Med Chem 47:4716-30 (2004)  
Target
Name:
Glycogen synthase kinase-3 beta
Synonyms:
GSK-3 beta GSK3B Glycogen synthase kinase 3 beta (GSK3B) Glycogen synthase kinase-3 beta (GSK-3B) Glycogen synthase kinase-3 beta (GSK3B) Glycogen synthase kinase-3beta (GSK3B) | Serine/threonine-protein kinase GSK3B
Type:
Enzyme
Mol. Mass.:
46756.38
Organism:
Homo sapiens (Human)
Description:
P49841
Residue:
420
  
Inhibitor
Name:
BDBM8140
Synonyms:
N-[4-chloro-3-(trifluoromethyl)phenyl]-4-{pyrazolo[1,5-a]pyridazin-3-yl}pyrimidin-2-amine | pyrazolo[1,5-b]pyridazine deriv. 31
Type:
Small organic molecule
Emp. Form.:
C17H10ClF3N6
Mol. Mass.:
390.75
SMILES:
FC(F)(F)c1cc(Nc2nccc(n2)-c2cnn3ncccc23)ccc1Cl
:
Substrate
Name:
Biotinylated Peptide Substrate
Synonyms:
Type:
Peptide
Mol. Mass.:
6828.27
Organism:
Description:
Residue:
63