Target
Retinoic acid receptor RXR-beta
Ligand
BDBM524179
Substrate
Meas. Tech.
FLIPR Assay
IC50
524±n/a nM
Citation
 Giovannini, RCeci, ADorner-Ciossek, CPfau, RWiedenmayer, D 4-pyrazin-2-ylmethyl-morpholine derivatives and the use thereof as medicament US Patent  US11166958 Publication Date 11/9/2021 
Target
Name:
Retinoic acid receptor RXR-beta
Synonyms:
NR2B2 RXRB Retinoic acid receptor RXR-beta Retinoid receptor
Type:
PROTEIN
Mol. Mass.:
56932.89
Organism:
Homo sapiens (Human)
Description:
ChEMBL_39045
Residue:
533
  
Inhibitor
Name:
BDBM524179
Synonyms:
US11166958, Example 31
Type:
Small organic molecule
Emp. Form.:
C19H23FN4O3
Mol. Mass.:
374.4093
SMILES:
CCNC(=O)[C@@H]1CN(Cc2cnc(Oc3ccc(C)cc3F)cn2)CCO1
: