Target
Non-receptor tyrosine-protein kinase TYK2
Ligand
BDBM538736
Substrate
Meas. Tech.
JAK Caliper Enzyme Assay at 1mM ATP
IC50
7.00±n/a nM
Citation
 Gerstenberger, BSFensome, AOwen, DRBrown, MFHayward, MMVajdos, FXing, LHWright, SW Pyrazolo[1,5-A]pyrazin-4-yl and related derivatives US Patent  US11254668 Publication Date 2/22/2022 
Target
Name:
Non-receptor tyrosine-protein kinase TYK2
Synonyms:
Non-receptor tyrosine-protein kinase TYK2 (TYK2) TYK2_HUMAN | Tyrosine-protein kinase TYK2
Type:
Protein
Mol. Mass.:
133666.03
Organism:
Homo sapiens (Human)
Description:
P29597
Residue:
1187
  
Inhibitor
Name:
BDBM538736
Synonyms:
US11254668, Example 76 | US11254668, Example 77
Type:
Small organic molecule
Emp. Form.:
C21H16N8
Mol. Mass.:
380.4053
SMILES:
N#CCC1(CC(C1)C#N)n1ccc(n1)-c1nc(cc2ncccc12)-c1cn[nH]c1
: