Target
Tyrosine-protein kinase JAK1 [837-1142]
Ligand
BDBM400458
Substrate
Meas. Tech.
In Vitro JAK Kinase Assay
IC50
<5±n/a nM
Citation
 Huang, TXue, C Piperidin-4-yl azetidine derivatives as JAK1 inhibitors US Patent  US11285140 Publication Date 3/29/2022 
Target
Name:
Tyrosine-protein kinase JAK1 [837-1142]
Synonyms:
JAK1 JAK1A JAK1_HUMAN Tyrosine-protein kinase JAK1 (837-1142) | Tyrosine-protein kinase JAK1 (aa 837-1142)
Type:
Mol. Mass.:
35230.04
Organism:
Homo sapiens (Human)
Description:
P23458[837-1142]
Residue:
306
  
Inhibitor
Name:
BDBM400458
Synonyms:
US10695337, Example 213 US9999619, Example 213
Type:
Small organic molecule
Emp. Form.:
C27H26F4N8
Mol. Mass.:
538.5426
SMILES:
Fc1cccc(c1CN1CCC(CC1)N1CC(CC#N)(C1)n1cc(cn1)-c1ncnc2[nH]ccc12)C(F)(F)F
: