Target
Tyrosine-protein kinase JAK1 [837-1142]
Ligand
BDBM400549
Substrate
Meas. Tech.
In Vitro JAK Kinase Assay
IC50
<5±n/a nM
Citation
 Huang, TXue, C Piperidin-4-yl azetidine derivatives as JAK1 inhibitors US Patent  US11285140 Publication Date 3/29/2022 
Target
Name:
Tyrosine-protein kinase JAK1 [837-1142]
Synonyms:
JAK1 JAK1A JAK1_HUMAN Tyrosine-protein kinase JAK1 (837-1142) | Tyrosine-protein kinase JAK1 (aa 837-1142)
Type:
Mol. Mass.:
35230.04
Organism:
Homo sapiens (Human)
Description:
P23458[837-1142]
Residue:
306
  
Inhibitor
Name:
BDBM400549
Synonyms:
US10695337, Example 305 US9999619, Example 305
Type:
Small organic molecule
Emp. Form.:
C27H26ClFN8O
Mol. Mass.:
533
SMILES:
Fc1ccc(NC(=O)N2CCC(CC2)N2CC(CC#N)(C2)n2cc(cn2)-c2ccnc3[nH]ccc23)c(Cl)c1
: