Target
Tyrosine-protein kinase JAK1 [837-1142]
Ligand
BDBM400629
Substrate
Meas. Tech.
In Vitro JAK Kinase Assay
IC50
<5±n/a nM
Citation
 Huang, TXue, C Piperidin-4-yl azetidine derivatives as JAK1 inhibitors US Patent  US11285140 Publication Date 3/29/2022 
Target
Name:
Tyrosine-protein kinase JAK1 [837-1142]
Synonyms:
JAK1 JAK1A JAK1_HUMAN Tyrosine-protein kinase JAK1 (837-1142) | Tyrosine-protein kinase JAK1 (aa 837-1142)
Type:
Mol. Mass.:
35230.04
Organism:
Homo sapiens (Human)
Description:
P23458[837-1142]
Residue:
306
  
Inhibitor
Name:
BDBM400629
Synonyms:
US10695337, Example 385 US9999619, Example 385 | {1-(1-{[6-{[(3-hydroxypropyl)(methyl)amino]methyl}-2-(trifluoromethyl)pyrimidin-4-yl]carbonyl}piperidin-4-yl)-3-[4-(7H-pyrrolo[2,3-d]pyrimidin-4-yl)-1H-pyrazol-1-yl]azetidin-3-yl}acetonitrile
Type:
Small organic molecule
Emp. Form.:
C30H34F3N11O2
Mol. Mass.:
637.6587
SMILES:
CN(CCCO)Cc1cc(nc(n1)C(F)(F)F)C(=O)N1CCC(CC1)N1CC(CC#N)(C1)n1cc(cn1)-c1ncnc2[nH]ccc12
: