Target
Replicase polyprotein 1a
Ligand
BDBM510127
Substrate
Meas. Tech.
SARS-CoV-2 Coronavirus 3C Protease FRET Assay
Ki
1.000±n/a nM
Citation
 Owen, DRPettersson, MYReese, MRSammons, MFTuttle, JBVerhoest, PRWei, LYang, QYang, X Nitrile-containing antiviral compounds US Patent  US11351149 Publication Date 6/7/2022 
Target
Name:
Replicase polyprotein 1a
Synonyms:
ORF1a polyprotein Replicase polyprotein 1a pp1a
Type:
Protein
Mol. Mass.:
489977.97
Organism:
2019-nCoV
Description:
P0DTC1
Residue:
4405
  
Inhibitor
Name:
BDBM510127
Synonyms:
Methyl {(2S)-1-[(1R,2S,5S)-2-({(1S)-1-cyano-2-[(3S)-2-oxopyrrolidin-3- yl]ethyl}carbamoyl)-6,6-dimethyl-3-azabicyclo[3.1.0]hexan-3-yl]-3,3-dimethyl-1- oxobutan-2-yl}carbamate (79) WO2021250648, Example 79 | WO2021250648, Example 95
Type:
Small organic molecule
Emp. Form.:
C23H35N5O5
Mol. Mass.:
461.5545
SMILES:
COC(=O)N[C@H](C(=O)N1C[C@H]2[C@@H]([C@H]1C(=O)N[C@@H](C[C@@H]1CCNC1=O)C#N)C2(C)C)C(C)(C)C
: