Target
Arginase-2, mitochondrial
Ligand
BDBM290388
Substrate
IC50
125±n/a nM
Citation
 Van Zandt, MJagdmann, GE Arginase inhibitors as therapeutics US Patent  US11389464 Publication Date 7/19/2022 
Target
Name:
Arginase-2, mitochondrial
Synonyms:
ARG2 Arginase II Non-hepatic arginase | Type II arginase
Type:
PROTEIN
Mol. Mass.:
38576.93
Organism:
Homo sapiens (Human)
Description:
ChEMBL_978892
Residue:
354
  
Inhibitor
Name:
BDBM290388
Synonyms:
(3R,4S)-3-amino-1-(2-aminoethyl)-4-(3-boronopropyl)pyrrolidine- 3-carboxylic acid US10603330, Example 24 | US11389464, Example 24
Type:
Small organic molecule
Emp. Form.:
C10H22BN3O4
Mol. Mass.:
259.11
SMILES:
NCCN1C[C@H](CCCB(O)O)[C@@](N)(C1)C(O)=O
: