Target
Tyrosine-protein kinase JAK1
Ligand
BDBM569236
Substrate
Meas. Tech.
JAK Kinase Assays
IC50
0.000±n/a nM
Citation
 deLong, MASturdivant, JMLichorowic, CLKornilov, A Aryl cyclopropyl-amino-isoquinolinyl amide compounds US Patent  US11427563 Publication Date 8/30/2022 
Target
Name:
Tyrosine-protein kinase JAK1
Synonyms:
JAK-1 JAK1A JAK1_HUMAN Janus kinase 1 (JAK1) | Janus kinase 1 JAK1
Type:
Protein
Mol. Mass.:
133293.73
Organism:
Homo sapiens (Human)
Description:
P23458
Residue:
1154
  
Inhibitor
Name:
BDBM569236
Synonyms:
US11427563, Compound 103
Type:
Small organic molecule
Emp. Form.:
C25H22N4O3S
Mol. Mass.:
458.532
SMILES:
Cc1cncc2ccc(NC(=O)[C@@H]3C[C@H]3c3ccc(cc3)S(=O)(=O)Nc3ccccn3)cc12
: