Target
Non-receptor tyrosine-protein kinase TYK2
Ligand
BDBM305812
Substrate
Meas. Tech.
JAK Caliper Enzyme Assay at 1 mM ATP
IC50
8.00±n/a nM
Citation
 Brown, MFDermenci, AFensome, AGerstenberger, BSHayward, MMOwen, DRWright, SWXing, LHYang, X Pyrazolo[1,5-a]pyrazin-4-yl derivatives US Patent  US11472809 Publication Date 10/18/2022 
Target
Name:
Non-receptor tyrosine-protein kinase TYK2
Synonyms:
Non-receptor tyrosine-protein kinase TYK2 (TYK2) TYK2_HUMAN | Tyrosine-protein kinase TYK2
Type:
Protein
Mol. Mass.:
133666.03
Organism:
Homo sapiens (Human)
Description:
P29597
Residue:
1187
  
Inhibitor
Name:
BDBM305812
Synonyms:
2,2′-((1s,3s)-1-(4-(6-(1-Methyl-1H-pyrazol-4-yl)pyrazolo[1,5-a]pyrazin-4-yl)-1H-pyrazol-1-yl)cyclobutane-1,3-diyl)diacetonitrile (cis isomer) US10822341, Example 11 | US11472809, Example 11
Type:
Small organic molecule
Emp. Form.:
C21H19N9
Mol. Mass.:
397.4359
SMILES:
Cn1cc(cn1)-c1cn2nccc2c(n1)-c1cnn(c1)[C@]1(CC#N)C[C@H](CC#N)C1
: