Target
Ataxin-2
Ligand
BDBM241152
Substrate
Meas. Tech.
Inhibition Assay
IC50
5.00±n/a nM
Citation
 Furminger, VHughes, ORLe Grand, DMStanley, EThomson, C Autotaxin inhibitors US Patent  US9630945 Publication Date 4/25/2017 
Target
Name:
Ataxin-2
Synonyms:
ATX2 ATXN2 Spinocerebellar ataxia type 2 protein Trinucleotide repeat-containing gene 13 protein
Type:
Mol. Mass.:
140337.65
Organism:
Homo sapiens (Human)
Description:
Q99700
Residue:
1313
  
Inhibitor
Name:
BDBM241152
Synonyms:
US9409895, 62 | US9630945, 62
Type:
Small organic molecule
Emp. Form.:
C21H26F3N5O3
Mol. Mass.:
453.458
SMILES:
Cc1cc(COC(=O)N2CCC(CC2)NC(=O)CCCc2c[nH]nn2)cc(c1)C(F)(F)F
: