Target
Non-receptor tyrosine-protein kinase TYK2
Ligand
BDBM329926
Substrate
Meas. Tech.
Caliper Enzyme Assay
IC50
4.00±n/a nM
Citation
 Fensome, AGopalsamy, AGerstenberger, BSEfremov, IVWan, ZPierce, BTelliez, JTrujillo, JIZhang, LXing, LSaiah, E Aminopyrimidinyl compounds US Patent  US9663526 Publication Date 5/30/2017 
Target
Name:
Non-receptor tyrosine-protein kinase TYK2
Synonyms:
Non-receptor tyrosine-protein kinase TYK2 (TYK2) TYK2_HUMAN | Tyrosine-protein kinase TYK2
Type:
Protein
Mol. Mass.:
133666.03
Organism:
Homo sapiens (Human)
Description:
P29597
Residue:
1187
  
Inhibitor
Name:
BDBM329926
Synonyms:
US10463675, Example 9 US11197867, Example 9 | US9663526, Example 9
Type:
Small organic molecule
Emp. Form.:
C23H27FN6O2
Mol. Mass.:
438.4979
SMILES:
CCNC(=O)c1ccc(Nc2ncc(F)c(n2)N2C[C@@H]3CC[C@H](C2)N3C(=O)C2CC2)cc1
: