Target
Flap endonuclease 1
Ligand
BDBM167060
Substrate
Meas. Tech.
Binding Assay
Ki
0.400±n/a nM
Citation
 Eccles, WFitzgerald, AEHack, MDHawryluk, NAJones, WMKeith, JMKrawczuk, PLebsack, ADLiu, JMani, NSMcClure, KJMeduna, SPRosen, MD FLAP modulators US Patent  US9732093 Publication Date 8/15/2017 
Target
Name:
Flap endonuclease 1
Synonyms:
DNase IV FEN1 Flap structure-specific endonuclease 1 Maturation factor 1 hFEN-1
Type:
PROTEIN
Mol. Mass.:
42602.57
Organism:
Homo sapiens (Human)
Description:
ChEMBL_1517026
Residue:
380
  
Inhibitor
Name:
BDBM167060
Synonyms:
US9073876, 146 | US9732093, Compound 146
Type:
Small organic molecule
Emp. Form.:
C25H23FN6O
Mol. Mass.:
442.4881
SMILES:
Nc1cnc(cn1)-c1ccc(C2CCC2)c(Oc2cc(N)nc(Cc3ccccc3)n2)c1F
: