Target
Flap endonuclease 1
Ligand
BDBM168633
Substrate
Meas. Tech.
Binding Assay
Ki
1.000±n/a nM
Citation
 Bacani, GMEccles, WFitzgerald, AEGoldberg, SDHack, MDHawryluk, NAJones, WMKeith, JMKrawczuk, PLebsack, ADLee-Dutra, ALiu, JMcClure, KJMeduna, SPPippel, DJRosen, MDSales, ZS Flap modulators US Patent  US9745328 Publication Date 8/29/2017 
Target
Name:
Flap endonuclease 1
Synonyms:
DNase IV FEN1 Flap structure-specific endonuclease 1 Maturation factor 1 hFEN-1
Type:
PROTEIN
Mol. Mass.:
42602.57
Organism:
Homo sapiens (Human)
Description:
ChEMBL_1517026
Residue:
380
  
Inhibitor
Name:
BDBM168633
Synonyms:
US9079866, 6 US9884878, Compound 6
Type:
Small organic molecule
Emp. Form.:
C22H23FN4O2S
Mol. Mass.:
426.507
SMILES:
Nc1cnc(cn1)-c1ccc(cc1F)-c1ccccc1S(=O)(=O)NC1CCCCC1
: