Target
Flap endonuclease 1
Ligand
BDBM283677
Substrate
Meas. Tech.
Binding Assay
Ki
<1±n/a nM
Comments
Zero 01/04/2022
Citation
 Bacani, GMEccles, WFitzgerald, AEGoldberg, SDHack, MDHawryluk, NAJones, WMKeith, JMKrawczuk, PLebsack, ADLee-Dutra, ALiu, JMcClure, KJMeduna, SPPippel, DJRosen, MDSales, ZS Flap modulators US Patent  US9745328 Publication Date 8/29/2017 
Target
Name:
Flap endonuclease 1
Synonyms:
DNase IV FEN1 Flap structure-specific endonuclease 1 Maturation factor 1 hFEN-1
Type:
PROTEIN
Mol. Mass.:
42602.57
Organism:
Homo sapiens (Human)
Description:
ChEMBL_1517026
Residue:
380
  
Inhibitor
Name:
BDBM283677
Synonyms:
5-[3-Fluoro-2'-(pyrimidin-2-yloxy)-4'- (trifluoromethyl)biphenyl-4-yl]pyrazin-2-amine US9884878, Compound 551
Type:
Small organic molecule
Emp. Form.:
C21H13F4N5O
Mol. Mass.:
427.3544
SMILES:
Nc1cnc(cn1)-c1ccc(cc1F)-c1ccc(cc1Oc1ncccn1)C(F)(F)F
: