Target
Dimer of Gag-Pol polyprotein [489-587,K509R,V521I,L522F,M525I,L552P,A560V,V571A,L579M]
Ligand
BDBM520
Substrate
HIV Protease Chromogenic Peptide Substrate
Meas. Tech.
Protease Inhibition Assay
pH
4.7±n/a
Temperature
310.15±n/a K
Ki
30±2 nM
Km
47000±5000 nM
Comments
kcat/Km=0.58 +/-0.07 uM-1sec-1
Citation
 Clemente, JCMoose, REHemrajani, RWhitford, LRGovindasamy, LReutzel, RMcKenna, RAgbandje-McKenna, MGoodenow, MMDunn, BM Comparing the accumulation of active- and nonactive-site mutations in the HIV-1 protease. Biochemistry 43:12141-51 (2004)  
Target
Name:
Dimer of Gag-Pol polyprotein [489-587,K509R,V521I,L522F,M525I,L552P,A560V,V571A,L579M]
Synonyms:
HIV-1 Protease Mutant V6 The post-ritonavir therapy protease variant
Type:
Protein Complex
Mol. Mass.:
Description:
The HIV-1 PR DNA for all of the HIV LAI variants was cloned, and protein was expressed, purified, and refolded from Escherichia coli strain BL21.
Components:
This complex has 2 components.
Component 1
Name:
Gag-Pol polyprotein [489-587,K509R,V521I,L522F,M525I,L552P,A560V,V571A,L579M]
Synonyms:
HIV-1 Protease Mutant V6 chain A POL_HV1H2 | gag-pol
Type:
Enzyme Subunit
Mol. Mass.:
10841.17
Organism:
Human immunodeficiency virus type 1
Description:
P04585[489-587,K509R,V521I,L522F,M525I,L552P,A560V,V571A,L579M]
Residue:
99
  
Component 2
Name:
Gag-Pol polyprotein [489-587,K509R,V521I,L522F,M525I,L552P,A560V,V571A,L579M]
Synonyms:
HIV-1 Protease Mutant V6 chain A POL_HV1H2 | gag-pol
Type:
Enzyme Subunit
Mol. Mass.:
10841.17
Organism:
Human immunodeficiency virus type 1
Description:
P04585[489-587,K509R,V521I,L522F,M525I,L552P,A560V,V571A,L579M]
Residue:
99
  
Inhibitor
Name:
BDBM520
Synonyms:
1,3-thiazol-5-ylmethyl N-[(2S,3S,5S)-3-hydroxy-5-[(2S)-3-methyl-2-{[methyl({[2-(propan-2-yl)-1,3-thiazol-4-yl]methyl})carbamoyl]amino}butanamido]-1,6-diphenylhexan-2-yl]carbamate CHEMBL163 RTV | Ritonavir
Type:
Small organic molecule
Emp. Form.:
C37H48N6O5S2
Mol. Mass.:
720.944
SMILES:
CC(C)[C@H](NC(=O)N(C)Cc1csc(n1)C(C)C)C(=O)N[C@H](C[C@H](O)[C@H](Cc1ccccc1)NC(=O)OCc1cncs1)Cc1ccccc1
:
Substrate
Name:
HIV Protease Chromogenic Peptide Substrate
Synonyms:
Type:
Peptide
Mol. Mass.:
1420.11
Organism:
Description:
Residue:
13
KARVLNPHEANLG