Target
Dimer of Gag-Pol polyprotein [489-587,K509R,V521I,L522F,M525I,M535I,L552P,A560V,V571A,L579M]
Ligand
BDBM520
Substrate
HIV Protease Chromogenic Peptide Substrate
Meas. Tech.
Protease Inhibition Assay
pH
4.7±n/a
Temperature
310.15±n/a K
Ki
65±8 nM
Km
27000±4000 nM
Comments
kcat/Km=0.43 +/- 0.07 uM-1sec-1
Citation
 Clemente, JCMoose, REHemrajani, RWhitford, LRGovindasamy, LReutzel, RMcKenna, RAgbandje-McKenna, MGoodenow, MMDunn, BM Comparing the accumulation of active- and nonactive-site mutations in the HIV-1 protease. Biochemistry 43:12141-51 (2004)  
Target
Name:
Dimer of Gag-Pol polyprotein [489-587,K509R,V521I,L522F,M525I,M535I,L552P,A560V,V571A,L579M]
Synonyms:
HIV-1 Protease Mutant V6(46) | HIV-1 protease mutant (K20R V32I L33F M36I M46I L63P A71V V82A L90M)
Type:
Protein Complex
Mol. Mass.:
Description:
The post-ritonavir therapy protease variant plus M46I mutation, which was created by site-directed mutagenesis.
Components:
This complex has 2 components.
Component 1
Name:
Gag-Pol polyprotein [489-587,K509R,V521I,L522F,M525I,M535I,L552P,A560V,V571A,L579M]
Synonyms:
HIV-1 Protease Mutant V6(46) chain A POL_HV1H2 | gag-pol
Type:
Enzyme Subunit
Mol. Mass.:
10823.13
Organism:
Human immunodeficiency virus type 1
Description:
P04585[489-587,K509R,V521I,L522F,M525I,M535I,L552P,A560V,V571A,L579M]
Residue:
99
  
Component 2
Name:
Gag-Pol polyprotein [489-587,K509R,V521I,L522F,M525I,M535I,L552P,A560V,V571A,L579M]
Synonyms:
HIV-1 Protease Mutant V6(46) chain A POL_HV1H2 | gag-pol
Type:
Enzyme Subunit
Mol. Mass.:
10823.13
Organism:
Human immunodeficiency virus type 1
Description:
P04585[489-587,K509R,V521I,L522F,M525I,M535I,L552P,A560V,V571A,L579M]
Residue:
99
  
Inhibitor
Name:
BDBM520
Synonyms:
1,3-thiazol-5-ylmethyl N-[(2S,3S,5S)-3-hydroxy-5-[(2S)-3-methyl-2-{[methyl({[2-(propan-2-yl)-1,3-thiazol-4-yl]methyl})carbamoyl]amino}butanamido]-1,6-diphenylhexan-2-yl]carbamate CHEMBL163 RTV | Ritonavir
Type:
Small organic molecule
Emp. Form.:
C37H48N6O5S2
Mol. Mass.:
720.944
SMILES:
CC(C)[C@H](NC(=O)N(C)Cc1csc(n1)C(C)C)C(=O)N[C@H](C[C@H](O)[C@H](Cc1ccccc1)NC(=O)OCc1cncs1)Cc1ccccc1
:
Substrate
Name:
HIV Protease Chromogenic Peptide Substrate
Synonyms:
Type:
Peptide
Mol. Mass.:
1420.11
Organism:
Description:
Residue:
13
KARVLNPHEANLG