Target
Dimer of Gag-Pol polyprotein [489-587,K509R,V521I,L522F,M525I,L552P,A560V,V571A,I573V,L579M]
Ligand
BDBM517
Substrate
HIV Protease Chromogenic Peptide Substrate
Meas. Tech.
Protease Inhibition Assay
Ki
289±n/a nM
Citation
 Clemente, JCMoose, REHemrajani, RWhitford, LRGovindasamy, LReutzel, RMcKenna, RAgbandje-McKenna, MGoodenow, MMDunn, BM Comparing the accumulation of active- and nonactive-site mutations in the HIV-1 protease. Biochemistry 43:12141-51 (2004)  
Target
Name:
Dimer of Gag-Pol polyprotein [489-587,K509R,V521I,L522F,M525I,L552P,A560V,V571A,I573V,L579M]
Synonyms:
HIV-1 Protease Mutant V6(84) | HIV-1 protease mutant (K20R V32I L33F M36I L63P A71V V82A I84V L90M)
Type:
Protein Complex
Mol. Mass.:
Description:
The post-ritonavir therapy protease variant plus I84V mutation, which was created by site-directed mutagenesis.
Components:
This complex has 2 components.
Component 1
Name:
Gag-Pol polyprotein [489-587,K509R,V521I,L522F,M525I,L552P,A560V,V571A,I573V,L579M]
Synonyms:
HIV-1 Protease Mutant V6(84) chain A POL_HV1H2 | gag-pol
Type:
Enzyme Subunit
Mol. Mass.:
10827.15
Organism:
Human immunodeficiency virus type 1
Description:
P04585[489-587,K509R,V521I,L522F,M525I,L552P,A560V,V571A,I573V,L579M]
Residue:
99
  
Component 2
Name:
Gag-Pol polyprotein [489-587,K509R,V521I,L522F,M525I,L552P,A560V,V571A,I573V,L579M]
Synonyms:
HIV-1 Protease Mutant V6(84) chain A POL_HV1H2 | gag-pol
Type:
Enzyme Subunit
Mol. Mass.:
10827.15
Organism:
Human immunodeficiency virus type 1
Description:
P04585[489-587,K509R,V521I,L522F,M525I,L552P,A560V,V571A,I573V,L579M]
Residue:
99
  
Inhibitor
Name:
BDBM517
Synonyms:
(2S)-1-[(2S,4R)-4-benzyl-2-hydroxy-4-{[(1S,2R)-2-hydroxy-2,3-dihydro-1H-inden-1-yl]carbamoyl}butyl]-N-tert-butyl-4-(pyridin-3-ylmethyl)piperazine-2-carboxamide Crixivan Indinavir L-735, 524 | MK639
Type:
Small organic molecule
Emp. Form.:
C36H47N5O4
Mol. Mass.:
613.7895
SMILES:
CC(C)(C)NC(=O)[C@@H]1CN(Cc2cccnc2)CCN1C[C@@H](O)C[C@@H](Cc1ccccc1)C(=O)N[C@@H]1[C@H](O)Cc2ccccc12
:
Substrate
Name:
HIV Protease Chromogenic Peptide Substrate
Synonyms:
Type:
Peptide
Mol. Mass.:
1420.11
Organism:
Description:
Residue:
13
KARVLNPHEANLG