Target
Dimer of Gag-Pol polyprotein [490-588,L523I,E525D,M526I,I544V,L553H,H559K,L579M]
Ligand
BDBM518
Substrate
HIV Protease Chromogenic Peptide Substrate
Meas. Tech.
Protease Inhibition Assay
Ki
17±n/a nM
Citation
 Clemente, JCComan, RMThiaville, MMJanka, LKJeung, JANukoolkarn, SGovindasamy, LAgbandje-McKenna, MMcKenna, RLeelamanit, WGoodenow, MMDunn, BM Analysis of HIV-1 CRF_01 A/E protease inhibitor resistance: structural determinants for maintaining sensitivity and developing resistance to atazanavir. Biochemistry 45:5468-77 (2006)  
Target
Name:
Dimer of Gag-Pol polyprotein [490-588,L523I,E525D,M526I,I544V,L553H,H559K,L579M]
Synonyms:
HIV-1 Protease AE-P Mutant (F82V) Post-therapy HIV-1 CRF_01 A/E protease F82V back mutant
Type:
Protein Complex
Mol. Mass.:
Description:
HIV-1 protease DNA for all the HIV B and AE variants was cloned, and protein was expressed and purified from Escherichia coli strain BL21.
Components:
This complex has 2 components.
Component 1
Name:
Gag-Pol polyprotein [490-588,L523I,E525D,M526I,I544V,L553H,H559K,L579M]
Synonyms:
HIV-1 Protease AE-P Mutant (F82V) Chain A POL_HV1RH | gag-pol
Type:
Enzyme Subunit
Mol. Mass.:
10768.14
Organism:
Human immunodeficiency virus type 1
Description:
P05959[490-588,L523I,E525D,M526I,I544V,L553H,H559K,L579M]
Residue:
99
  
Component 2
Name:
Gag-Pol polyprotein [490-588,L523I,E525D,M526I,I544V,L553H,H559K,L579M]
Synonyms:
HIV-1 Protease AE-P Mutant (F82V) Chain A POL_HV1RH | gag-pol
Type:
Enzyme Subunit
Mol. Mass.:
10768.14
Organism:
Human immunodeficiency virus type 1
Description:
P05959[490-588,L523I,E525D,M526I,I544V,L553H,H559K,L579M]
Residue:
99
  
Inhibitor
Name:
BDBM518
Synonyms:
(3S,4aS,8aS)-N-tert-butyl-2-[(2R,3R)-2-hydroxy-3-[(3-hydroxy-2-methylphenyl)formamido]-4-(phenylsulfanyl)butyl]-decahydroisoquinoline-3-carboxamide CHEMBL584 Viracept
Type:
Small organic molecule
Emp. Form.:
C32H45N3O4S
Mol. Mass.:
567.782
SMILES:
Cc1c(O)cccc1C(=O)N[C@@H](CSc1ccccc1)[C@H](O)CN1C[C@H]2CCCC[C@H]2C[C@H]1C(=O)NC(C)(C)C
:
Substrate
Name:
HIV Protease Chromogenic Peptide Substrate
Synonyms:
Type:
Peptide
Mol. Mass.:
1420.11
Organism:
Description:
Residue:
13
KARVLNPHEANLG