Target
Glycine--tRNA ligase
Ligand
BDBM18134
Substrate
BDBM18133
Meas. Tech.
In Vitro Enzyme Activity Assay
pH
7.5±n/a
Temperature
298.15±n/a K
Ki
20000±n/a nM
IC50
100000±n/a nM
Citation
 Dignam, JDNada, SChaires, JB Thermodynamic characterization of the binding of nucleotides to glycyl-tRNA synthetase. Biochemistry 42:5333-40 (2003)  
Target
Name:
Glycine--tRNA ligase
Synonyms:
GARS_BOMMO Glycine--tRNA ligase tRNA synthetase (GlyRS)
Type:
Enzyme
Mol. Mass.:
76917.70
Organism:
Bombyx mori
Description:
B. mori glycyltRNA synthetase was expressed in E. coli.
Residue:
680
  
Inhibitor
Name:
BDBM18134
Synonyms:
({[({[(2R,3S,4R,5R)-5-(6-amino-9H-purin-9-yl)-3,4-dihydroxyoxolan-2-yl]methoxy}(hydroxy)phosphoryl)oxy](hydroxy)phosphoryl}amino)phosphonic acid AMP.P[NH]P | AMPPNP
Type:
Nucleoside or nucleotide
Emp. Form.:
C10H17N6O12P3
Mol. Mass.:
506.1963
SMILES:
Nc1ncnc2n(cnc12)[C@@H]1O[C@H](COP(O)(=O)OP(O)(=O)NP(O)(O)=O)[C@@H](O)[C@H]1O
:
Substrate
Name:
BDBM18133
Synonyms:
2-aminoacetic acid Glycine | [14C]Glycine
Type:
Amino Acid
Emp. Form.:
C2H5NO2
Mol. Mass.:
75.0666
SMILES:
NCC(O)=O
: