Target
Angiotensin-converting enzyme 2
Ligand
BDBM21475
Substrate
BDBM21453
Meas. Tech.
Enzyme Inhibition Assay
pH
6.8±n/a
Temperature
298.15±n/a K
Ki
220±n/a nM
Citation
 Mores, AMatziari, MBeau, FCuniasse, PYiotakis, ADive, V Development of Potent and Selective Phosphinic Peptide Inhibitors of Angiotensin-Converting Enzyme 2. J Med Chem 51:2216-2226 (2008)  
Target
Name:
Angiotensin-converting enzyme 2
Synonyms:
ACE-related carboxypeptidase ACE2_HUMAN Angiotensin-converting enzyme homolog Metalloprotease MPROT15
Type:
Enzyme
Mol. Mass.:
92448.86
Organism:
Homo sapiens (Human)
Description:
Residue:
805
  
Inhibitor
Name:
BDBM21475
Synonyms:
3-({1-[2-acetamido-3-(1H-imidazol-4-yl)propanamido]-3-methylbutyl}(hydroxy)phosphoryl)-2-[(3-phenyl-1,2-oxazol-5-yl)methyl]propanoic acid The second fraction of the HPLC chromatogram.
Type:
Small organic molecule
Emp. Form.:
C26H34N5O7P
Mol. Mass.:
559.5512
SMILES:
CC(C)CC(NC(=O)C(Cc1cnc[nH]1)NC(C)=O)P(O)(=O)CC(Cc1cc(no1)-c1ccccc1)C(O)=O
:
Substrate
Name:
BDBM21453
Synonyms:
(7-methoxycoumarin-4-yl)acetyl-Ala-Pro-Lys(2,4-dinitrophenyl)-OH Mca-Ala-Pro-Lys(Dnp)-OH
Type:
Fluorogenic Substrate
Emp. Form.:
Mol. Mass.:
SMILES:
: