Target
Dimer of Gag-Pol polyprotein [501-599]
Ligand
BDBM154
Substrate
Fluorescent peptide substrate
Meas. Tech.
Protease Inhibition Assay
pH
5.5±n/a
Temperature
310.15±n/a K
Ki
0.03±n/a nM
Citation
 Lam, PYRu, YJadhav, PKAldrich, PEDeLucca, GVEyermann, CJChang, CHEmmett, GHoller, ERDaneker, WFLi, LConfalone, PNMcHugh, RJHan, QLi, RMarkwalder, JASeitz, SPSharpe, TRBacheler, LTRayner, MMKlabe, RMShum, LWinslow, DLKornhauser, DMHodge, CN Cyclic HIV protease inhibitors: synthesis, conformational analysis, P2/P2' structure-activity relationship, and molecular recognition of cyclic ureas. J Med Chem 39:3514-25 (1996)  
Target
Name:
Dimer of Gag-Pol polyprotein [501-599]
Synonyms:
HIV-1 Protease | HIV-1 Protease, recombinant, isolate HXB2
Type:
Protein Complex
Mol. Mass.:
Description:
Components:
This complex has 2 components.
Component 1
Name:
Gag-Pol polyprotein [501-599]
Synonyms:
BRU isolated HIV-1 Protease B Subtype Chain B LAI(Wild type) Protease Retropepsin | gag-pol
Type:
Enzyme Subunit
Mol. Mass.:
10795.19
Organism:
Human immunodeficiency virus type 1
Description:
P03367[501-599]
Residue:
99
  
Component 2
Name:
Gag-Pol polyprotein [501-599]
Synonyms:
BRU isolated HIV-1 Protease B Subtype Chain B LAI(Wild type) Protease Retropepsin | gag-pol
Type:
Enzyme Subunit
Mol. Mass.:
10795.19
Organism:
Human immunodeficiency virus type 1
Description:
P03367[501-599]
Residue:
99
  
Inhibitor
Name:
BDBM154
Synonyms:
3-{[(4R,5S,6S,7R)-4,7-dibenzyl-5,6-dihydroxy-2-oxo-3-{[3-(1,3-thiazol-2-ylcarbamoyl)phenyl]methyl}-1,3-diazepan-1-yl]methyl}-N-(1,3-thiazol-2-yl)benzamide XV638
Type:
Emp. Form.:
C41H38N6O5S2
Mol. Mass.:
758.908
SMILES:
O[C@@H]1[C@@H](O)[C@@H](Cc2ccccc2)N(Cc2cccc(c2)C(=O)Nc2nccs2)C(=O)N(Cc2cccc(c2)C(=O)Nc2nccs2)[C@@H]1Cc1ccccc1
:
Substrate
Name:
Fluorescent peptide substrate
Synonyms:
Type:
Peptide
Mol. Mass.:
4608.75
Organism:
Description:
Residue:
42