Target
Dimer of Gag-Pol polyprotein [489-587]
Ligand
BDBM580
Substrate
HIV-1 Protease substrate
Meas. Tech.
Protease Inhibition Assay
pH
6±n/a
Temperature
310.15±n/a K
Ki
0.33±n/a nM
Citation
 Mimoto, TKato, RTakaku, HNojima, STerashima, KMisawa, SFukazawa, TUeno, TSato, HShintani, MKiso, YHayashi, H Structure-activity relationship of small-sized HIV protease inhibitors containing allophenylnorstatine. J Med Chem 42:1789-802 (1999)  
Target
Name:
Dimer of Gag-Pol polyprotein [489-587]
Synonyms:
HIV-1 Protease
Type:
Protein Complex
Mol. Mass.:
Description:
Components:
This complex has 2 components.
Component 1
Name:
Gag-Pol polyprotein [489-587]
Synonyms:
HIV protease HIV-1 Protease chain A POL_HV1N5 | gag-pol
Type:
Enzyme Subunit
Mol. Mass.:
10822.21
Organism:
Human immunodeficiency virus type 1
Description:
P12497[489-587]
Residue:
99
  
Component 2
Name:
Gag-Pol polyprotein [489-587]
Synonyms:
HIV protease HIV-1 Protease chain A POL_HV1N5 | gag-pol
Type:
Enzyme Subunit
Mol. Mass.:
10822.21
Organism:
Human immunodeficiency virus type 1
Description:
P12497[489-587]
Residue:
99
  
Inhibitor
Name:
BDBM580
Synonyms:
(4R)-3-[(2S,3S)-2-hydroxy-3-[(3-hydroxy-2-methylphenyl)formamido]-4-phenylbutanoyl]-5,5-dimethyl-N-[(2-methylphenyl)methyl]-1,3-thiazolidine-4-carboxamide BDBM50288366 KNI-764
Type:
Small organic molecule
Emp. Form.:
C32H37N3O5S
Mol. Mass.:
575.718
SMILES:
Cc1ccccc1CNC(=O)[C@H]1N(CSC1(C)C)C(=O)[C@@H](O)[C@H](Cc1ccccc1)NC(=O)c1cccc(O)c1C
:
Substrate
Name:
HIV-1 Protease substrate
Synonyms:
Type:
Peptide
Mol. Mass.:
2535.82
Organism:
Synthetic peptide
Description:
Residue:
22