Target
Dimer of Gag-Pol polyprotein [501-599]
Ligand
BDBM17350
Substrate
Chromogenic peptide substrate
Meas. Tech.
Protease Inhibition Assay
pH
4.7±n/a
Ki
0.15±n/a nM
Citation
 Skalova, THasek, JDohnalek, JPetrokova, HBuchtelova, EDuskova, JSoucek, MMajer, PUhlikova, TKonvalinka, J An ethylenamine inhibitor binds tightly to both wild type and mutant HIV-1 proteases. Structure and energy study. J Med Chem 46:1636-44 (2003)  
Target
Name:
Dimer of Gag-Pol polyprotein [501-599]
Synonyms:
HIV-1 Protease
Type:
Protein Complex
Mol. Mass.:
Description:
Components:
This complex has 2 components.
Component 1
Name:
Gag-Pol polyprotein [501-599]
Synonyms:
BRU isolated HIV-1 Protease B Subtype Chain B LAI(Wild type) Protease Retropepsin | gag-pol
Type:
Enzyme Subunit
Mol. Mass.:
10795.19
Organism:
Human immunodeficiency virus type 1
Description:
P03367[501-599]
Residue:
99
  
Component 2
Name:
Gag-Pol polyprotein [501-599]
Synonyms:
BRU isolated HIV-1 Protease B Subtype Chain B LAI(Wild type) Protease Retropepsin | gag-pol
Type:
Enzyme Subunit
Mol. Mass.:
10795.19
Organism:
Human immunodeficiency virus type 1
Description:
P03367[501-599]
Residue:
99
  
Inhibitor
Name:
BDBM17350
Synonyms:
(4S)-4-[(2S)-2-{[(2S,3S)-3-{[(tert-butoxy)carbonyl]amino}-2-hydroxy-4-phenylbutyl]amino}-3-phenylpropanamido]-4-{[(1S)-1-carbamoyl-2-phenylethyl]carbamoyl}butanoic acid | CHEMBL386563
Type:
Small organic molecule
Emp. Form.:
C38H49N5O8
Mol. Mass.:
703.8244
SMILES:
CC(C)(C)OC(=O)N[C@@H](Cc1ccccc1)[C@@H](O)CN[C@@H](Cc1ccccc1)C(=O)N[C@@H](CCC(O)=O)C(=O)N[C@@H](Cc1ccccc1)C(N)=O
:
Substrate
Name:
Chromogenic peptide substrate
Synonyms:
Type:
Peptide
Mol. Mass.:
2942.29
Organism:
Description:
Residue:
28