Target
Mitogen-activated protein kinase 1
Ligand
BDBM35664
Substrate
erktide
Meas. Tech.
Ki Determination
pH
7.5±n/a
Temperature
303.15±n/a K
Ki
15±n/a nM
Citation
 Aronov, AMTang, QMartinez-Botella, GBemis, GWCao, JChen, GEwing, NPFord, PJGermann, UAGreen, JHale, MRJacobs, MJanetka, JWMaltais, FMarkland, WNamchuk, MNNanthakumar, SPoondru, SStraub, Jter Haar, EXie, X Structure-guided design of potent and selective pyrimidylpyrrole inhibitors of extracellular signal-regulated kinase (ERK) using conformational control. J Med Chem 52:6362-8 (2009)  
Target
Name:
Mitogen-activated protein kinase 1
Synonyms:
ERK2 Extracellular signal-regulated kinase 2 Extracellular signal-regulated kinase 2 (ERK2) MAPK 2 MK01_HUMAN Mitogen-activated protein kinase 1 (ERK-2) Mitogen-activated protein kinase 2 PRKM2 | p42-MAPK
Type:
Ser/Thr Protein Kinase
Mol. Mass.:
41392.76
Organism:
Homo sapiens (Human)
Description:
P28482
Residue:
360
  
Inhibitor
Name:
BDBM35664
Synonyms:
erk000628 | pyrimidylpyrrole, 11l
Type:
Small organic molecule
Emp. Form.:
C26H24ClN5O4
Mol. Mass.:
505.953
SMILES:
Cc1cnc(Nc2cccc3OCCOc23)nc1-c1c[nH]c(c1)C(=O)N[C@H](CO)c1cccc(Cl)c1
:
Substrate
Name:
ERKtide
Synonyms:
Type:
Peptide
Mol. Mass.:
1314.49
Organism:
Description:
Residue:
13
ATGPLSPGPFGRR