Target
Dimer of Gag-Pol polyprotein [489-587]
Ligand
BDBM1113
Substrate
Fluorescent peptide substrate
Meas. Tech.
Protease Inhibition Assay
pH
5.5±n/a
Temperature
310.15±n/a K
Ki
0.03±n/a nM
Citation
 De Lucca, GVLiang, JDe Lucca, I Stereospecific synthesis, structure-activity relationship, and oral bioavailability of tetrahydropyrimidin-2-one HIV protease inhibitors. J Med Chem 42:135-52 (1999)  
Target
Name:
Dimer of Gag-Pol polyprotein [489-587]
Synonyms:
HIV-1 Protease
Type:
Tandem linked enzyme construct
Mol. Mass.:
Description:
Components:
This complex has 2 components.
Component 1
Name:
Gag-Pol polyprotein [489-587]
Synonyms:
Human immunodeficiency virus type 1 protease Pol polyprotein | gag-pol
Type:
Enzyme Subunit
Mol. Mass.:
10781.16
Organism:
Human immunodeficiency virus type 1
Description:
P04585[489-587]
Residue:
99
  
Component 2
Name:
Gag-Pol polyprotein [489-587]
Synonyms:
Human immunodeficiency virus type 1 protease Pol polyprotein | gag-pol
Type:
Enzyme Subunit
Mol. Mass.:
10781.16
Organism:
Human immunodeficiency virus type 1
Description:
P04585[489-587]
Residue:
99
  
Inhibitor
Name:
BDBM1113
Synonyms:
(4R,5R,6R)-Tetrahydro-5-hydroxy-1,3-bis[(3-(thiazol-2-yl)carboxamidophenyl)methyl]-4-(2-phenylethyl)-6-(phenylmethyl)-2(1H)-pyrimidinone Tetrahydropyrimidinone deriv. 74
Type:
Small organic molecule
Emp. Form.:
C41H38N6O4S2
Mol. Mass.:
742.908
SMILES:
O[C@@H]1[C@@H](CCc2ccccc2)N(Cc2cccc(c2)C(=O)Nc2nccs2)C(=O)N(Cc2cccc(c2)C(=O)Nc2nccs2)[C@@H]1Cc1ccccc1
:
Substrate
Name:
Fluorescent peptide substrate
Synonyms:
Type:
Peptide
Mol. Mass.:
4608.75
Organism:
Description:
Residue:
42