Target
Tyrosine-protein kinase ABL1 [1-999,Q252H]
Ligand
BDBM31088
Substrate
Meas. Tech.
Kinase Inhibitor Selectivity Profiling Assay
Kd
580000±n/a nM
Citation
 PubChem, PC Kinase Inhibitor Selectivity Profiling Assay PubChem Bioassay (2008)[AID] 
Target
Name:
Tyrosine-protein kinase ABL1 [1-999,Q252H]
Synonyms:
ABL ABL1(Q252H) JTK7 Tyrosine-protein kinase ABL (dephosphorylated)
Type:
Enzyme Catalytic Domain
Mol. Mass.:
108590.01
Organism:
Homo sapiens (Human)
Description:
gi_62362414
Residue:
999
  
Inhibitor
Name:
BDBM31088
Synonyms:
1-methyl-5-[2-[5-(trifluoromethyl)-1H-imidazol-2-yl]pyridin-4-yl]oxy-N-[4-(trifluoromethyl)phenyl]benzimidazol-2-amine CHIR-265 cid_11656518
Type:
Small organic molecule
Emp. Form.:
C24H16F6N6O
Mol. Mass.:
518.4139
SMILES:
Cn1c(Nc2ccc(cc2)C(F)(F)F)nc2cc(Oc3ccnc(c3)-c3ncc([nH]3)C(F)(F)F)ccc12
: