Target
Tyrosine-protein kinase ABL1 [1-999,Q252H]
Ligand
BDBM68220
Substrate
Meas. Tech.
Biochemcial Assay
pH
7.5±0
IC50
>5000±0.0 nM
Citation
 Okram, BNagle, AAdrián, FJLee, CRen, PWang, XSim, TXie, YWang, XXia, GSpraggon, GWarmuth, MLiu, YGray, NS A general strategy for creating "inactive-conformation" abl inhibitors. Chem Biol 13:779-86 (2006)  
Target
Name:
Tyrosine-protein kinase ABL1 [1-999,Q252H]
Synonyms:
ABL ABL1(Q252H) JTK7 Tyrosine-protein kinase ABL (dephosphorylated)
Type:
Enzyme Catalytic Domain
Mol. Mass.:
108590.01
Organism:
Homo sapiens (Human)
Description:
gi_62362414
Residue:
999
  
Inhibitor
Name:
BDBM68220
Synonyms:
Type II inhibitor, 15
Type:
Small organic molecule
Emp. Form.:
C23H21F3N6O2
Mol. Mass.:
470.447
SMILES:
CN(C(=O)c1cccc(c1)C(F)(F)F)c1ccc(C)c(c1)N1Cc2cnc(N)nc2N(C)C1=O
: