Target
Atrial natriuretic peptide receptor 1
Ligand
BDBM50254098
Substrate
Meas. Tech.
ChEBML_1686037
IC50
120±n/a nM
Citation
 Nishizawa, NNakamura, GNoguchi, YNakagawa, HShimizu, ANakayama, MTakekawa, SAsami, T A potent and selective natriuretic peptide receptor-3 blocker 11-mer peptide created by hybridization of musclin and atrial natriuretic peptide. Bioorg Med Chem Lett 27:3542-3545 (2017)  
Target
Name:
Atrial natriuretic peptide receptor 1
Synonyms:
ANP-A ANPRA_HUMAN Atrial natriuretic peptide receptor GC-A NPR-A | NPR1
Type:
PROTEIN
Mol. Mass.:
118919.35
Organism:
Homo sapiens (Human)
Description:
ChEMBL_700223
Residue:
1061
  
Inhibitor
Name:
BDBM50254098
Synonyms:
CHEMBL4098363
Type:
Small organic molecule
Emp. Form.:
C46H83N17O12S
Mol. Mass.:
1098.323
SMILES:
CC[C@H](C)[C@H](NC(=O)[C@H](CCCNC(N)=N)NC(=O)[C@H](CC(O)=O)NC(=O)[C@@H](NC(=O)[C@H](CCCNC(N)=N)NC(=O)CNC(=O)CNC(=O)[C@H](CC1CCCCC1)NC(=O)[C@@H](N)CS)[C@@H](C)CC)C(=O)NCC(N)=O
: