Target
Atrial natriuretic peptide receptor 1
Ligand
BDBM50254082
Substrate
Meas. Tech.
ChEBML_1686037
IC50
>1000±n/a nM
Citation
 Nishizawa, NNakamura, GNoguchi, YNakagawa, HShimizu, ANakayama, MTakekawa, SAsami, T A potent and selective natriuretic peptide receptor-3 blocker 11-mer peptide created by hybridization of musclin and atrial natriuretic peptide. Bioorg Med Chem Lett 27:3542-3545 (2017)  
Target
Name:
Atrial natriuretic peptide receptor 1
Synonyms:
ANP-A ANPRA_HUMAN Atrial natriuretic peptide receptor GC-A NPR-A | NPR1
Type:
PROTEIN
Mol. Mass.:
118919.35
Organism:
Homo sapiens (Human)
Description:
ChEMBL_700223
Residue:
1061
  
Inhibitor
Name:
BDBM50254082
Synonyms:
CHEMBL4073884
Type:
Small organic molecule
Emp. Form.:
C48H85N17O13S
Mol. Mass.:
1140.36
SMILES:
CC[C@H](C)[C@H](NC(=O)[C@H](CCCNC(N)=N)NC(=O)[C@H](CC(O)=O)NC(=O)[C@@H](NC(=O)[C@H](CCCNC(N)=N)NC(=O)CNC(=O)CNC(=O)[C@H](CC1CCCCC1)NC(=O)[C@H](CS)NC(C)=O)[C@@H](C)CC)C(=O)NCC(N)=O
: