Target
Retinoic acid receptor RXR-beta
Ligand
BDBM50276797
Substrate
Meas. Tech.
ChEBML_1716419
IC50
>10000±n/a nM
Citation
 Patch, RJHuang, HPatel, SCheung, WXu, GZhao, BPBeauchamp, DARentzeperis, DGeisler, JGAskari, HBLiu, JKasturi, JTowers, MGaul, MDPlayer, MR Indazole-based ligands for estrogen-related receptor ? as potential anti-diabetic agents. Eur J Med Chem 138:830-853 (2017)  
Target
Name:
Retinoic acid receptor RXR-beta
Synonyms:
NR2B2 RXRB Retinoic acid receptor RXR-beta Retinoid receptor
Type:
PROTEIN
Mol. Mass.:
56932.89
Organism:
Homo sapiens (Human)
Description:
ChEMBL_39045
Residue:
533
  
Inhibitor
Name:
BDBM50276797
Synonyms:
CHEMBL4174856
Type:
Small organic molecule
Emp. Form.:
C25H21ClF4N4O2S
Mol. Mass.:
552.971
SMILES:
CN1CC[C@H]([C@H](F)C1)N1C(=O)S\C(=C/c2ccc3n(Cc4ccc(Cl)cc4C(F)(F)F)ncc3c2)C1=O
: