Target
Androgen receptor
Ligand
BDBM18699
Substrate
Meas. Tech.
ChEMBL_304043 (CHEMBL877110)
Ki
0.301995±n/a nM
Citation
 Söderholm, AALehtovuori, PTNyrönen, TH Three-dimensional structure-activity relationships of nonsteroidal ligands in complex with androgen receptor ligand-binding domain. J Med Chem 48:917-25 (2005)  
Target
Name:
Androgen receptor
Synonyms:
ANDR_RAT Ar Nr3c4 | androgen
Type:
Enzyme
Mol. Mass.:
98219.08
Organism:
Rattus norvegicus (Rat)
Description:
P15207
Residue:
902
  
Inhibitor
Name:
BDBM18699
Synonyms:
(2R)-3-bromo-2-hydroxy-2-methyl-N-[4-nitro-3-(trifluoromethyl)phenyl]propanamide R-3
Type:
Small organic molecule
Emp. Form.:
C11H10BrF3N2O4
Mol. Mass.:
371.107
SMILES:
C[C@](O)(CBr)C(=O)Nc1ccc(c(c1)C(F)(F)F)[N+]([O-])=O
: