Target
UDP-3-O-acyl-N-acetylglucosamine deacetylase
Ligand
BDBM50074960
Substrate
Meas. Tech.
ChEMBL_809999 (CHEMBL2015108)
Ki
50±n/a nM
Citation
 Warmus, JSQuinn, CLTaylor, CMurphy, STJohnson, TALimberakis, COrtwine, DBronstein, JPagano, PKnafels, JDLightle, SMochalkin, IBrideau, RPodoll, T Structure based design of an in vivo active hydroxamic acid inhibitor of P. aeruginosa LpxC. Bioorg Med Chem Lett 22:2536-43 (2012)  
Target
Name:
UDP-3-O-acyl-N-acetylglucosamine deacetylase
Synonyms:
LPXC_ECOLI UDP-3-O-[3-hydroxymyristoyl] N-acetylglucosamine deacetylase (LxpC) asmB lpxC
Type:
Enzyme
Mol. Mass.:
33952.00
Organism:
Escherichia coli
Description:
P0A725
Residue:
305
  
Inhibitor
Name:
BDBM50074960
Synonyms:
(R)-2-(3,4-Dimethoxy-5-propyl-phenyl)-4,5-dihydro-oxazole-4-carboxylic acid hydroxyamide CHEMBL107313 | L-161240
Type:
Small organic molecule
Emp. Form.:
C15H20N2O5
Mol. Mass.:
308.3297
SMILES:
CCCc1cc(cc(OC)c1OC)C1=N[C@H](CO1)C(=O)NO
: