Target
Retinoic acid receptor alpha
Ligand
BDBM50032219
Substrate
Meas. Tech.
ChEMBL_197382 (CHEMBL799701)
EC50
21±n/a nM
Citation
 Beard, RLChandraratna, RAColon, DFGillett, SJHenry, EMarler, DKSong, TDenys, LGarst, MEArefieg, T Synthesis and structure-activity relationships of stilbene retinoid analogs substituted with heteroaromatic carboxylic acids. J Med Chem 38:2820-9 (1995)  
Target
Name:
Retinoic acid receptor alpha
Synonyms:
NR1B1 RAR-alpha RARA_HUMAN Retinoic acid receptor alpha/Retinoid X receptor alpha Retinoid receptor
Type:
PROTEIN
Mol. Mass.:
50778.87
Organism:
Homo sapiens (Human)
Description:
ChEMBL_1466191
Residue:
462
  
Inhibitor
Name:
BDBM50032219
Synonyms:
(E)-4-(2-(5,5,8,8-tetramethyl-5,6,7,8-tetrahydronaphthalen-2-yl)prop-1-enyl)benzoic acid 4-[(1E)-2-(5,5,8,8-TETRAMETHYL-5,6,7,8-TETRAHYDRONAPHTHALEN-2-YL)PROP-1-ENYL]BENZOIC ACID 4-[(E)-2-(5,6,7,8-tetrahydro-5,5,8,8-tetramethyl-2-naphthalenyl)-1-propenyl]benzoic acid CHEMBL275311 | US9963439, TTNPB
Type:
Small organic molecule
Emp. Form.:
C24H28O2
Mol. Mass.:
348.4779
SMILES:
C\C(=C/c1ccc(cc1)C(O)=O)c1ccc2c(c1)C(C)(C)CCC2(C)C
: