Target
Retinoic acid receptor RXR-alpha
Ligand
BDBM50032672
Substrate
Meas. Tech.
ChEMBL_196764 (CHEMBL797916)
Kd
>1000±n/a nM
Citation
 Boehm, MFZhang, LZhi, LMcClurg, MRBerger, EWagoner, MMais, DESuto, CMDavies, JAHeyman, RA Design and synthesis of potent retinoid X receptor selective ligands that induce apoptosis in leukemia cells. J Med Chem 38:3146-55 (1995)  
Target
Name:
Retinoic acid receptor RXR-alpha
Synonyms:
NR2B1 Nuclear receptor subfamily 4 group A member 2 RXRA Retinoic acid receptor RXR-alpha/gamma Retinoid receptor
Type:
PROTEIN
Mol. Mass.:
50820.38
Organism:
Homo sapiens (Human)
Description:
ChEMBL_1456363
Residue:
462
  
Inhibitor
Name:
BDBM50032672
Synonyms:
4-[1-(3,8,8-Trimethyl-5,6,7,8-tetrahydro-naphthalen-2-yl)-vinyl]-benzoic acid | CHEMBL107039
Type:
Small organic molecule
Emp. Form.:
C22H24O2
Mol. Mass.:
320.4248
SMILES:
Cc1cc2CCCC(C)(C)c2cc1C(=C)c1ccc(cc1)C(O)=O
: