Target
Retinoic acid receptor RXR-beta
Ligand
BDBM50032662
Substrate
Meas. Tech.
ChEMBL_197061 (CHEMBL807508)
EC50
280±n/a nM
Citation
 Boehm, MFZhang, LZhi, LMcClurg, MRBerger, EWagoner, MMais, DESuto, CMDavies, JAHeyman, RA Design and synthesis of potent retinoid X receptor selective ligands that induce apoptosis in leukemia cells. J Med Chem 38:3146-55 (1995)  
Target
Name:
Retinoic acid receptor RXR-beta
Synonyms:
Nr2b2 Retinoid X receptor beta | Rxrb
Type:
PROTEIN
Mol. Mass.:
55877.78
Organism:
Mus musculus
Description:
ChEMBL_196588
Residue:
520
  
Inhibitor
Name:
BDBM50032662
Synonyms:
4-[1-(1,1,2,3,3,6-Hexamethyl-indan-5-yl)-vinyl]-benzoic acid | CHEMBL106837
Type:
Small organic molecule
Emp. Form.:
C24H28O2
Mol. Mass.:
348.4779
SMILES:
CC1C(C)(C)c2cc(C)c(cc2C1(C)C)C(=C)c1ccc(cc1)C(O)=O
: