Target
Adenosine deaminase
Ligand
BDBM28393
Substrate
Meas. Tech.
ChEMBL_30936 (CHEMBL646740)
Ki
0.82±n/a nM
Citation
 Vargeese, CSarma, MSPragnacharyulu, PVAbushanab, ELi, SYStoeckler, JD Adenosine deaminase inhibitors. Synthesis and biological evaluation of putative metabolites of (+)-erythro-9-(2S-hydroxy-3R-nonyl)adenine. J Med Chem 37:3844-9 (1994)  
Target
Name:
Adenosine deaminase
Synonyms:
ADA Adenosine aminohydrolase
Type:
Enzyme
Mol. Mass.:
40910.44
Organism:
Bos taurus (bovine)
Description:
Residue:
363
  
Inhibitor
Name:
BDBM28393
Synonyms:
(+)-EHNA CHEMBL296435
Type:
Small organic molecule
Emp. Form.:
C14H23N5O
Mol. Mass.:
277.3653
SMILES:
CCCCCC[C@H]([C@H](C)O)n1cnc2c(N)ncnc12
: