Target
Retinoic acid receptor RXR-gamma
Ligand
BDBM50044099
Substrate
Meas. Tech.
ChEMBL_196654 (CHEMBL800767)
IC50
10±n/a nM
Citation
 Boehm, MFMcClurg, MRPathirana, CMangelsdorf, DWhite, SKHebert, JWinn, DGoldman, MEHeyman, RA Synthesis of high specific activity [3H]-9-cis-retinoic acid and its application for identifying retinoids with unusual binding properties. J Med Chem 37:408-14 (1994)  
Target
Name:
Retinoic acid receptor RXR-gamma
Synonyms:
NR2B3 RXRG Retinoic acid receptor RXR-gamma Retinoid X receptor gamma/retinoic acid receptor alpha
Type:
PROTEIN
Mol. Mass.:
50878.26
Organism:
Homo sapiens (Human)
Description:
ChEMBL_197216
Residue:
463
  
Inhibitor
Name:
BDBM50044099
Synonyms:
4-[(E)-2-(3-Ethyl-5,5,8,8-tetramethyl-5,6,7,8-tetrahydro-naphthalen-2-yl)-propenyl]-benzoic acid | CHEMBL284937
Type:
Small organic molecule
Emp. Form.:
C26H32O2
Mol. Mass.:
376.5311
SMILES:
CCc1cc2c(cc1\C(C)=C\c1ccc(cc1)C(O)=O)C(C)(C)CCC2(C)C
: