Target
Acyl-protein thioesterase 1
Ligand
BDBM50496629
Substrate
Meas. Tech.
ChEMBL_1300908 (CHEMBL3135195)
IC50
2.5±n/a nM
Citation
 Davda, DMartin, BR Acyl protein thioesterase inhibitors as probes of dynamic S-palmitoylation. Medchemcomm 5:268-276 (2014)  
Target
Name:
Acyl-protein thioesterase 1
Synonyms:
APT-1 Acyl-protein thioesterase 1 (APT1 WT) LPL1 LYPLA1 Lysophospholipase 1 hAPT1
Type:
Protein
Mol. Mass.:
24670.33
Organism:
Homo sapiens (Human)
Description:
O75608
Residue:
230
  
Inhibitor
Name:
BDBM50496629
Synonyms:
CHEMBL3133031
Type:
Small organic molecule
Emp. Form.:
C22H43NO4S
Mol. Mass.:
417.646
SMILES:
CCCCCCCCCC[C@H]1[C@H](CCCCS(=O)(=O)CCCN(C)C)OC1=O
: