Target
Retinoic acid receptor gamma
Ligand
BDBM50045274
Substrate
Meas. Tech.
ChEBML_163495
EC50
1500±n/a nM
Citation
 Jong, LLehmann, JMHobbs, PDHarlev, EHuffman, JCPfahl, MDawson, MI Conformational effects on retinoid receptor selectivity. 1. Effect of 9-double bond geometry on retinoid X receptor activity. J Med Chem 36:2605-13 (1993)  
Target
Name:
Retinoic acid receptor gamma
Synonyms:
NR1B3 RAR-gamma RARG_HUMAN Retinoic acid receptor gamma | Retinoid receptor
Type:
PROTEIN
Mol. Mass.:
50345.43
Organism:
Homo sapiens (Human)
Description:
ChEMBL_1458016
Residue:
454
  
Inhibitor
Name:
BDBM50045274
Synonyms:
4-[2-(4,4-Dimethyl-thiochroman-6-yl)-1-methyl-vinyl]-benzoic acid | CHEMBL87147
Type:
Small organic molecule
Emp. Form.:
C21H22O2S
Mol. Mass.:
338.463
SMILES:
C\C(=C\c1ccc2SCCC(C)(C)c2c1)c1ccc(cc1)C(O)=O
: